Reaction Details
TargetTyrosine-protein kinase Lck
LigandBDBM50301606
Substrate/Competitorn/a
Meas. Tech.ChEMBL_600521 (CHEMBL1049046)
IC50 1.8±n/a nM
Citation Hunt, JABeresis, RTGoulet, JLHolmes, MAHong, XJKovacs, EMills, SGRuzek, RDWong, FHermes, JDPark, YWSalowe, SPSonatore, LMWu, LWoods, AZaller, DMSinclair, PJ Disubstituted pyrimidines as Lck inhibitors. Bioorg Med Chem Lett19:5440-3 (2009) 
 
Tyrosine-protein kinase Lck
Name:Tyrosine-protein kinase Lck
Type:n/a
Mol. Mass.:57987.83
Organism:Homo sapiens (Human)
Description:P06239
Residue:509
BDBM50301606
NameBDBM50301606
Synonyms:(S)-3-((S)-1-(4-(1H-benzo[d]imidazol-1-yl)pyrimidin-2-ylamino)ethyl)-4-hexyl-N-(naphthalen-1-yl)piperazine-1-carboxamide | CHEMBL567592
TypeSmall organic molecule
Emp. Form.C34H40N8O
Mol. Mass.576.7344
SMILESCCCCCCN1CCN(C[C@H]1[C@H](C)Nc1nccc(n1)-n1cnc2ccccc12)C(=O)Nc1cccc2ccccc12