Reaction Details
TargetTyrosine-protein kinase Lck
LigandBDBM50301608
Substrate/Competitorn/a
Meas. Tech.ChEMBL_600521 (CHEMBL1049046)
IC50 0.45±n/a nM
Citation Hunt, JABeresis, RTGoulet, JLHolmes, MAHong, XJKovacs, EMills, SGRuzek, RDWong, FHermes, JDPark, YWSalowe, SPSonatore, LMWu, LWoods, AZaller, DMSinclair, PJ Disubstituted pyrimidines as Lck inhibitors. Bioorg Med Chem Lett19:5440-3 (2009) 
 
Tyrosine-protein kinase Lck
Name:Tyrosine-protein kinase Lck
Type:n/a
Mol. Mass.:57987.83
Organism:Homo sapiens (Human)
Description:P06239
Residue:509
BDBM50301608
NameBDBM50301608
Synonyms:CHEMBL566507 | ethyl 2-((S)-2-((S)-1-(4-(1H-benzo[d]imidazol-1-yl)pyrimidin-2-ylamino)ethyl)-4-(naphthalen-1-ylcarbamoyl)piperazin-1-yl)acetate
TypeSmall organic molecule
Emp. Form.C32H34N8O3
Mol. Mass.578.6642
SMILESCCOC(=O)CN1CCN(C[C@H]1[C@H](C)Nc1nccc(n1)-n1cnc2ccccc12)C(=O)Nc1cccc2ccccc12