Reaction Details
TargetMetabotropic glutamate receptor 1
LigandBDBM50301818
Substrate/Competitorn/a
Meas. Tech.ChEMBL_598101 (CHEMBL1038283)
IC50 4.9±n/a nM
Citation Ito, SHirata, YNagatomi, YSatoh, ASuzuki, GKimura, TSatow, AMaehara, SHikichi, HHata, MOhta, HKawamoto, H Discovery and biological profile of isoindolinone derivatives as novel metabotropic glutamate receptor 1 antagonists: a potential treatment for psychotic disorders. Bioorg Med Chem Lett19:5310-3 (2009) 
 
Metabotropic glutamate receptor 1
Name:Metabotropic glutamate receptor 1
Type:Enzyme
Mol. Mass.:132358.19
Organism:Homo sapiens (Human)
Description:Q13255
Residue:1194
BDBM50301818
NameBDBM50301818
Synonyms:6-(5-methyl-1-(pyridin-3-yl)-1H-1,2,3-triazol-4-yl)quinoline | CHEMBL583590
TypeSmall organic molecule
Emp. Form.C17H13N5
Mol. Mass.287.3186
SMILESCc1c(nnn1-c1cccnc1)-c1ccc2ncccc2c1