Reaction Details
TargetC-X-C chemokine receptor type 2
LigandBDBM50302099
Substrate/Competitorn/a
Meas. Tech.ChEMBL_599856 (CHEMBL1043639)
IC50 5490±n/a nM
Citation Liu, SLiu, YWang, HDing, YWu, HDong, JWong, AChen, SHLi, GChan, MSawyer, NGervais, FGHenault, MKargman, SBedard, LLHan, YFriesen, RLobell, RBStout, DM Design, synthesis, and evaluation of novel 3-amino-4-hydrazine-cyclobut-3-ene-1,2-diones as potent and selective CXCR2 chemokine receptor antagonists. Bioorg Med Chem Lett19:5741-5 (2009) 
 
C-X-C chemokine receptor type 2
Name:C-X-C chemokine receptor type 2
Type:Protein
Mol. Mass.:40767.88
Organism:Homo sapiens (Human)
Description:P25025
Residue:360
BDBM50302099
NameBDBM50302099
Synonyms:3-(2-(2-ethylhydrazinyl)-3,4-dioxocyclobut-1-enylamino)-2-hydroxy-N,N-dimethylbenzamide | CHEMBL577738
TypeSmall organic molecule
Emp. Form.C15H18N4O4
Mol. Mass.318.3278
SMILESCCNNc1c(Nc2cccc(C(=O)N(C)C)c2O)c(=O)c1=O