Reaction Details
TargetPotassium voltage-gated channel subfamily H member 2
LigandBDBM50302398
Substrate/Competitorn/a
Meas. Tech.ChEMBL_597420 (CHEMBL1039906)
IC50 100000±n/a nM
Citation Mowbray, CEBurt, CCorbau, RGayton, SHawes, MPerros, MTran, IPrice, DAQuinton, FJSelby, MDStupple, PAWebster, RWood, A Pyrazole NNRTIs 4: selection of UK-453,061 (lersivirine) as a development candidate. Bioorg Med Chem Lett19:5857-60 (2009) 
 
Potassium voltage-gated channel subfamily H member 2
Name:Potassium voltage-gated channel subfamily H member 2
Type:Multi-pass membrane protein
Mol. Mass.:126672.65
Organism:Homo sapiens (Human)
Description:Q12809
Residue:1159
BDBM50302398
NameBDBM50302398
Synonyms:3-(3,5-diethyl-1H-pyrazol-4-yloxy)-5-methylbenzonitrile | CHEMBL576256
TypeSmall organic molecule
Emp. Form.C15H17N3O
Mol. Mass.255.315
SMILESCCc1n[nH]c(CC)c1Oc1cc(C)cc(c1)C#N