Reaction Details
TargetProtein kinase C beta type
LigandBDBM50302507
Substrate/Competitorn/a
Meas. Tech.ChEMBL_597640 (CHEMBL1039939)
IC50 1300±n/a nM
Citation Niu, CBoschelli, DHTumey, LNBhagirath, NSubrath, JShim, JWang, YWu, BEid, CLee, JYang, XBrennan, AChaudhary, D First generation 5-vinyl-3-pyridinecarbonitrile PKCtheta inhibitors. Bioorg Med Chem Lett19:5829-32 (2009) 
 
Protein kinase C beta type
Name:Protein kinase C beta type
Type:Enzyme
Mol. Mass.:76873.67
Organism:Homo sapiens (Human)
Description:The recombinant human PKC enzymes were produced using a baculovirus expression system in SF9 cells
Residue:671
BDBM50302507
NameBDBM50302507
Synonyms:4-(4-methyl-1H-indol-5-ylamino)-5-(3-(2-(4-methylpiperazin-1-yl)ethoxy)styryl)nicotinonitrile | CHEMBL567124
TypeSmall organic molecule
Emp. Form.C30H32N6O
Mol. Mass.492.6147
SMILESCN1CCN(CCOc2cccc(\C=C\c3cncc(C#N)c3Nc3ccc4[nH]ccc4c3C)c2)CC1