Reaction Details
TargetTyrosine-protein kinase Lyn
LigandBDBM50302507
Substrate/Competitorn/a
Meas. Tech.ChEMBL_597642 (CHEMBL1039941)
IC50 520±n/a nM
Citation Niu, CBoschelli, DHTumey, LNBhagirath, NSubrath, JShim, JWang, YWu, BEid, CLee, JYang, XBrennan, AChaudhary, D First generation 5-vinyl-3-pyridinecarbonitrile PKCtheta inhibitors. Bioorg Med Chem Lett19:5829-32 (2009) 
 
Tyrosine-protein kinase Lyn
Name:Tyrosine-protein kinase Lyn
Type:Protein
Mol. Mass.:58575.92
Organism:Homo sapiens (Human)
Description:P07948
Residue:512
BDBM50302507
NameBDBM50302507
Synonyms:4-(4-methyl-1H-indol-5-ylamino)-5-(3-(2-(4-methylpiperazin-1-yl)ethoxy)styryl)nicotinonitrile | CHEMBL567124
TypeSmall organic molecule
Emp. Form.C30H32N6O
Mol. Mass.492.6147
SMILESCN1CCN(CCOc2cccc(\C=C\c3cncc(C#N)c3Nc3ccc4[nH]ccc4c3C)c2)CC1