Reaction Details
TargetProtein kinase C delta type
LigandBDBM50302515
Substrate/Competitorn/a
Meas. Tech.ChEMBL_597636 (CHEMBL1039088)
IC50 620±n/a nM
Citation Niu, CBoschelli, DHTumey, LNBhagirath, NSubrath, JShim, JWang, YWu, BEid, CLee, JYang, XBrennan, AChaudhary, D First generation 5-vinyl-3-pyridinecarbonitrile PKCtheta inhibitors. Bioorg Med Chem Lett19:5829-32 (2009) 
 
Protein kinase C delta type
Name:Protein kinase C delta type
Type:Enzyme
Mol. Mass.:77516.79
Organism:Homo sapiens (Human)
Description:The recombinant human PKC enzymes were produced using a baculovirus expression system in SF9 cells
Residue:676
BDBM50302515
NameBDBM50302515
Synonyms:4-(2,4-dimethyl-1H-indol-5-ylamino)-5-styrylnicotinonitrile | CHEMBL585878
TypeSmall organic molecule
Emp. Form.C24H20N4
Mol. Mass.364.4424
SMILESCc1cc2c(C)c(Nc3c(\C=C\c4ccccc4)cncc3C#N)ccc2[nH]1