Reaction Details
TargetProtein kinase C delta type
LigandBDBM50302516
Substrate/Competitorn/a
Meas. Tech.ChEMBL_597636 (CHEMBL1039088)
IC50 1400±n/a nM
Citation Niu, CBoschelli, DHTumey, LNBhagirath, NSubrath, JShim, JWang, YWu, BEid, CLee, JYang, XBrennan, AChaudhary, D First generation 5-vinyl-3-pyridinecarbonitrile PKCtheta inhibitors. Bioorg Med Chem Lett19:5829-32 (2009) 
 
Protein kinase C delta type
Name:Protein kinase C delta type
Type:Enzyme
Mol. Mass.:77516.79
Organism:Homo sapiens (Human)
Description:The recombinant human PKC enzymes were produced using a baculovirus expression system in SF9 cells
Residue:676
BDBM50302516
NameBDBM50302516
Synonyms:4-(4,7-dimethyl-1H-indol-5-ylamino)-5-styrylnicotinonitrile | CHEMBL566060
TypeSmall organic molecule
Emp. Form.C24H20N4
Mol. Mass.364.4424
SMILESCc1cc(Nc2c(\C=C\c3ccccc3)cncc2C#N)c(C)c2cc[nH]c12