Reaction Details
TargetProtein kinase C delta type
LigandBDBM50302521
Substrate/Competitorn/a
Meas. Tech.ChEMBL_597636 (CHEMBL1039088)
IC50 1600±n/a nM
Citation Niu, CBoschelli, DHTumey, LNBhagirath, NSubrath, JShim, JWang, YWu, BEid, CLee, JYang, XBrennan, AChaudhary, D First generation 5-vinyl-3-pyridinecarbonitrile PKCtheta inhibitors. Bioorg Med Chem Lett19:5829-32 (2009) 
 
Protein kinase C delta type
Name:Protein kinase C delta type
Type:Enzyme
Mol. Mass.:77516.79
Organism:Homo sapiens (Human)
Description:The recombinant human PKC enzymes were produced using a baculovirus expression system in SF9 cells
Residue:676
BDBM50302521
NameBDBM50302521
Synonyms:4-(4-methyl-1H-indol-5-yloxy)-5-styrylnicotinonitrile | CHEMBL578984
TypeSmall organic molecule
Emp. Form.C23H17N3O
Mol. Mass.351.4006
SMILESCc1c(Oc2c(\C=C\c3ccccc3)cncc2C#N)ccc2[nH]ccc12