Reaction Details
TargetProtein kinase C delta type
LigandBDBM50302524
Substrate/Competitorn/a
Meas. Tech.ChEMBL_597636 (CHEMBL1039088)
IC50 420±n/a nM
Citation Niu, CBoschelli, DHTumey, LNBhagirath, NSubrath, JShim, JWang, YWu, BEid, CLee, JYang, XBrennan, AChaudhary, D First generation 5-vinyl-3-pyridinecarbonitrile PKCtheta inhibitors. Bioorg Med Chem Lett19:5829-32 (2009) 
 
Protein kinase C delta type
Name:Protein kinase C delta type
Type:Enzyme
Mol. Mass.:77516.79
Organism:Homo sapiens (Human)
Description:The recombinant human PKC enzymes were produced using a baculovirus expression system in SF9 cells
Residue:676
BDBM50302524
NameBDBM50302524
Synonyms:5-(2-cyclohexylvinyl)-4-(4-methyl-1H-indol-5-ylamino)nicotinonitrile | CHEMBL566074
TypeSmall organic molecule
Emp. Form.C23H24N4
Mol. Mass.356.4635
SMILESCc1c(Nc2c(\C=C\C3CCCCC3)cncc2C#N)ccc2[nH]ccc12