Reaction Details
TargetSodium/glucose cotransporter 2
LigandBDBM50303239
Substrate/Competitorn/a
Meas. Tech.ChEMBL_595350 (CHEMBL1050643)
IC50 1.3±n/a nM
Citation Lv, BXu, BFeng, YPeng, KXu, GDu, JZhang, LZhang, WZhang, TZhu, LDing, HSheng, ZWelihinda, ASeed, BChen, Y Exploration of O-spiroketal C-arylglucosides as novel and selective renal sodium-dependent glucose co-transporter 2 (SGLT2) inhibitors. Bioorg Med Chem Lett19:6877-81 (2009) 
 
Sodium/glucose cotransporter 2
Name:Sodium/glucose cotransporter 2
Type:Protein
Mol. Mass.:72902.00
Organism:Homo sapiens (Human)
Description:P31639
Residue:672
BDBM50303239
NameBDBM50303239
Synonyms:(1S,3'R,4'S,5'S,6'R)-5-chloro-4-(1-(4-ethylphenyl)cyclopropyl)-6'-(hydroxymethyl)-3',4',5',6'-tetrahydro-3H-spiro[isobenzofuran-1,2'-pyran]-3',4',5'-triol | CHEMBL566224
TypeSmall organic molecule
Emp. Form.C24H27ClO6
Mol. Mass.446.921
SMILESCCc1ccc(cc1)C1(CC1)c1c2CO[C@]3(O[C@H](CO)[C@@H](O)[C@H](O)[C@H]3O)c2ccc1Cl