Reaction Details
TargetMitogen-activated protein kinase 14
LigandBDBM31825
Substrate/Competitorn/a
Meas. Tech.ChEMBL_596266 (CHEMBL1050682)
IC50 90±n/a nM
Citation Klüter, SGrütter, CNaqvi, TRabiller, MSimard, JRPawar, VGetlik, MRauh, D Displacement assay for the detection of stabilizers of inactive kinase conformations. J Med Chem53:357-67 (2010) 
 
Mitogen-activated protein kinase 14
Name:Mitogen-activated protein kinase 14
Type:Serine/threonine-protein kinase
Mol. Mass.:41286.76
Organism:Homo sapiens (Human)
Description:Q16539
Residue:360
BDBM31825
NameBDBM31825
Synonyms:1-(1-(3-Aminophenyl)-3-tert-butyl-1H-pyrazol-5-yl)-3-(4-chlorophenyl)urea, 1c | pyrazolourea, 1b
TypeSmall organic molecule
Emp. Form.C24H25N5O
Mol. Mass.399.4882
SMILESCC(C)(C)c1cc(NC(=O)Nc2cccc3ccccc23)n(n1)-c1cccc(N)c1