Reaction Details
TargetMitogen-activated protein kinase 14
LigandBDBM50303597
Substrate/Competitorn/a
Meas. Tech.ChEMBL_596266 (CHEMBL1050682)
IC50 35±n/a nM
Citation Klüter, SGrütter, CNaqvi, TRabiller, MSimard, JRPawar, VGetlik, MRauh, D Displacement assay for the detection of stabilizers of inactive kinase conformations. J Med Chem53:357-67 (2010) 
 
Mitogen-activated protein kinase 14
Name:Mitogen-activated protein kinase 14
Type:Serine/threonine-protein kinase
Mol. Mass.:41286.76
Organism:Homo sapiens (Human)
Description:Q16539
Residue:360
BDBM50303597
NameBDBM50303597
Synonyms:(S)-2-(2-amino-3-phenylpropylamino)-3-methyl-5-(naphthalen-2-yl)-6-(pyridin-4-yl)pyrimidin-4(3H)-one CHEMBL585902 | US9187470, 47 (AMG-548)
TypeSmall organic molecule
Emp. Form.C29H27N5O
Mol. Mass.461.5576
SMILESCn1c(NC[C@@H](N)Cc2ccccc2)nc(-c2ccncc2)c(-c2ccc3ccccc3c2)c1=O