Reaction Details
TargetBeta-secretase 1
LigandBDBM50303716
Substrate/Competitorn/a
Meas. Tech.ChEMBL_597054 (CHEMBL1044549)
IC50 20±n/a nM
Citation Malamas, MSErdei, JGunawan, ITurner, JHu, YWagner, EFan, KChopra, ROlland, ABard, JJacobsen, SMagolda, RLPangalos, MRobichaud, AJ Design and synthesis of 5,5'-disubstituted aminohydantoins as potent and selective human beta-secretase (BACE1) inhibitors. J Med Chem53:1146-58 (2010) 
 
Beta-secretase 1
Name:Beta-secretase 1
Type:Protein
Mol. Mass.:55755.10
Organism:Homo sapiens (Human)
Description:P56817
Residue:501
BDBM50303716
NameBDBM50303716
Synonyms:2-amino-4-(4-fluoro-3-(pyrimidin-5-yl)phenyl)-4-(4-methoxy-3-methylphenyl)-1-methyl-1H-imidazol-5(4H)-one | CHEMBL567688
TypeSmall organic molecule
Emp. Form.C22H20FN5O2
Mol. Mass.405.4249
SMILESCOc1ccc(cc1C)C1(N=C(N)N(C)C1=O)c1ccc(F)c(c1)-c1cncnc1