Reaction Details
TargetBeta-secretase 1
LigandBDBM50303735
Substrate/Competitorn/a
Meas. Tech.ChEMBL_597054 (CHEMBL1044549)
IC50 520±n/a nM
Citation Malamas, MSErdei, JGunawan, ITurner, JHu, YWagner, EFan, KChopra, ROlland, ABard, JJacobsen, SMagolda, RLPangalos, MRobichaud, AJ Design and synthesis of 5,5'-disubstituted aminohydantoins as potent and selective human beta-secretase (BACE1) inhibitors. J Med Chem53:1146-58 (2010) 
 
Beta-secretase 1
Name:Beta-secretase 1
Type:Protein
Mol. Mass.:55755.10
Organism:Homo sapiens (Human)
Description:P56817
Residue:501
BDBM50303735
NameBDBM50303735
Synonyms:2-amino-4-(3-(2-methoxypyridin-3-yl)phenyl)-1-methyl-4-(4-(trifluoromethoxy)phenyl)-1H-imidazol-5(4H)-one | CHEMBL567259
TypeSmall organic molecule
Emp. Form.C23H19F3N4O3
Mol. Mass.456.4172
SMILESCOc1ncccc1-c1cccc(c1)C1(N=C(N)N(C)C1=O)c1ccc(OC(F)(F)F)cc1