Reaction Details
TargetBeta-secretase 1
LigandBDBM50303758
Substrate/Competitorn/a
Meas. Tech.ChEMBL_597054 (CHEMBL1044549)
IC50 120±n/a nM
Citation Malamas, MSErdei, JGunawan, ITurner, JHu, YWagner, EFan, KChopra, ROlland, ABard, JJacobsen, SMagolda, RLPangalos, MRobichaud, AJ Design and synthesis of 5,5'-disubstituted aminohydantoins as potent and selective human beta-secretase (BACE1) inhibitors. J Med Chem53:1146-58 (2010) 
 
Beta-secretase 1
Name:Beta-secretase 1
Type:Protein
Mol. Mass.:55755.10
Organism:Homo sapiens (Human)
Description:P56817
Residue:501
BDBM50303758
NameBDBM50303758
Synonyms:2-amino-4-(2,3-dihydrobenzofuran-5-yl)-1-methyl-4-(3-(pyridin-3-yl)phenyl)-1H-imidazol-5(4H)-one | CHEMBL566414
TypeSmall organic molecule
Emp. Form.C23H20N4O2
Mol. Mass.384.4305
SMILESCN1C(N)=NC(C1=O)(c1ccc2OCCc2c1)c1cccc(c1)-c1cccnc1