Reaction Details
TargetBeta-secretase 1
LigandBDBM50303726
Substrate/Competitorn/a
Meas. Tech.ChEMBL_597054 (CHEMBL1044549)
IC50 250±n/a nM
Citation Malamas, MSErdei, JGunawan, ITurner, JHu, YWagner, EFan, KChopra, ROlland, ABard, JJacobsen, SMagolda, RLPangalos, MRobichaud, AJ Design and synthesis of 5,5'-disubstituted aminohydantoins as potent and selective human beta-secretase (BACE1) inhibitors. J Med Chem53:1146-58 (2010) 
 
Beta-secretase 1
Name:Beta-secretase 1
Type:Protein
Mol. Mass.:55755.10
Organism:Homo sapiens (Human)
Description:P56817
Residue:501
BDBM50303726
NameBDBM50303726
Synonyms:2-amino-4-(benzo[d][1,3]dioxol-5-yl)-1-methyl-4-(3-(pyridin-3-yl)phenyl)-1H-imidazol-5(4H)-one | CHEMBL566415
TypeSmall organic molecule
Emp. Form.C22H18N4O3
Mol. Mass.386.4033
SMILESCN1C(N)=NC(C1=O)(c1ccc2OCOc2c1)c1cccc(c1)-c1cccnc1