Reaction Details
TargetBeta-secretase 1
LigandBDBM50303734
Substrate/Competitorn/a
Meas. Tech.ChEMBL_597054 (CHEMBL1044549)
IC50 270±n/a nM
Citation Malamas, MSErdei, JGunawan, ITurner, JHu, YWagner, EFan, KChopra, ROlland, ABard, JJacobsen, SMagolda, RLPangalos, MRobichaud, AJ Design and synthesis of 5,5'-disubstituted aminohydantoins as potent and selective human beta-secretase (BACE1) inhibitors. J Med Chem53:1146-58 (2010) 
 
Beta-secretase 1
Name:Beta-secretase 1
Type:Protein
Mol. Mass.:55755.10
Organism:Homo sapiens (Human)
Description:P56817
Residue:501
BDBM50303734
NameBDBM50303734
Synonyms:(S)-5-Adamantan-1-yl-2-amino-5-(4-methoxy-3-methyl-phenyl)-3-methyl-3,5-dihydro-imidazol-4-one | CHEMBL571320
TypeSmall organic molecule
Emp. Form.C22H29N3O2
Mol. Mass.367.4846
SMILESCOc1ccc(cc1C)[C@@]1(N=C(N)N(C)C1=O)C12CC3CC(CC(C3)C1)C2