Reaction Details
TargetBeta-secretase 1
LigandBDBM50303743
Substrate/Competitorn/a
Meas. Tech.ChEMBL_597054 (CHEMBL1044549)
IC50 320±n/a nM
Citation Malamas, MSErdei, JGunawan, ITurner, JHu, YWagner, EFan, KChopra, ROlland, ABard, JJacobsen, SMagolda, RLPangalos, MRobichaud, AJ Design and synthesis of 5,5'-disubstituted aminohydantoins as potent and selective human beta-secretase (BACE1) inhibitors. J Med Chem53:1146-58 (2010) 
 
Beta-secretase 1
Name:Beta-secretase 1
Type:Protein
Mol. Mass.:55755.10
Organism:Homo sapiens (Human)
Description:P56817
Residue:501
BDBM50303743
NameBDBM50303743
Synonyms:2-amino-4-(3-fluoro-5-(pyrimidin-5-yl)phenyl)-1-methyl-4-(4-(trifluoromethoxy)phenyl)-1H-imidazol-5(4H)-one | CHEMBL566633
TypeSmall organic molecule
Emp. Form.C21H15F4N5O2
Mol. Mass.445.3697
SMILESCN1C(N)=NC(C1=O)(c1ccc(OC(F)(F)F)cc1)c1cc(F)cc(c1)-c1cncnc1