Reaction Details
TargetBeta-secretase 1
LigandBDBM50303733
Substrate/Competitorn/a
Meas. Tech.ChEMBL_597054 (CHEMBL1044549)
IC50 90±n/a nM
Citation Malamas, MSErdei, JGunawan, ITurner, JHu, YWagner, EFan, KChopra, ROlland, ABard, JJacobsen, SMagolda, RLPangalos, MRobichaud, AJ Design and synthesis of 5,5'-disubstituted aminohydantoins as potent and selective human beta-secretase (BACE1) inhibitors. J Med Chem53:1146-58 (2010) 
 
Beta-secretase 1
Name:Beta-secretase 1
Type:Protein
Mol. Mass.:55755.10
Organism:Homo sapiens (Human)
Description:P56817
Residue:501
BDBM50303733
NameBDBM50303733
Synonyms:2-amino-4-(3,4-dimethoxyphenyl)-1-methyl-4-(3-(pyridin-3-yl)phenyl)-1H-imidazol-5(4H)-one | CHEMBL566403
TypeSmall organic molecule
Emp. Form.C23H22N4O3
Mol. Mass.402.4458
SMILESCOc1ccc(cc1OC)C1(N=C(N)N(C)C1=O)c1cccc(c1)-c1cccnc1