Reaction Details
TargetBeta-secretase 2
LigandBDBM50303731
Substrate/Competitorn/a
Meas. Tech.ChEMBL_597055 (CHEMBL1044550)
IC50 7540±n/a nM
Citation Malamas, MSErdei, JGunawan, ITurner, JHu, YWagner, EFan, KChopra, ROlland, ABard, JJacobsen, SMagolda, RLPangalos, MRobichaud, AJ Design and synthesis of 5,5'-disubstituted aminohydantoins as potent and selective human beta-secretase (BACE1) inhibitors. J Med Chem53:1146-58 (2010) 
 
Beta-secretase 2
Name:Beta-secretase 2
Type:Protein
Mol. Mass.:56171.20
Organism:Homo sapiens (Human)
Description:Q9Y5Z0
Residue:518
BDBM50303731
NameBDBM50303731
Synonyms:(5R)-2-amino-5-(4-fluoro-3-pyrimidin-5-ylphenyl)-3-methyl-5-[4-(trifluoromethoxy)phenyl]-3,5-dihydro-4H-imidazol-4-one CHEMBL568115
TypeSmall organic molecule
Emp. Form.C21H15F4N5O2
Mol. Mass.445.3697
SMILESCN1C(N)=N[C@](C1=O)(c1ccc(OC(F)(F)F)cc1)c1ccc(F)c(c1)-c1cncnc1