Reaction Details
TargetBeta-secretase 2
LigandBDBM50303752
Substrate/Competitorn/a
Meas. Tech.ChEMBL_597055 (CHEMBL1044550)
IC50 170±n/a nM
Citation Malamas, MSErdei, JGunawan, ITurner, JHu, YWagner, EFan, KChopra, ROlland, ABard, JJacobsen, SMagolda, RLPangalos, MRobichaud, AJ Design and synthesis of 5,5'-disubstituted aminohydantoins as potent and selective human beta-secretase (BACE1) inhibitors. J Med Chem53:1146-58 (2010) 
 
Beta-secretase 2
Name:Beta-secretase 2
Type:Protein
Mol. Mass.:56171.20
Organism:Homo sapiens (Human)
Description:Q9Y5Z0
Residue:518
BDBM50303752
NameBDBM50303752
Synonyms:2-amino-4-(3-butoxy-4-methoxyphenyl)-1-methyl-4-(3-(pyridin-3-yl)phenyl)-1H-imidazol-5(4H)-one | CHEMBL567061
TypeSmall organic molecule
Emp. Form.C26H28N4O3
Mol. Mass.444.5255
SMILESCCCCOc1cc(ccc1OC)C1(N=C(N)N(C)C1=O)c1cccc(c1)-c1cccnc1