Reaction Details
TargetBeta-secretase 2
LigandBDBM50303751
Substrate/Competitorn/a
Meas. Tech.ChEMBL_597055 (CHEMBL1044550)
IC50 500±n/a nM
Citation Malamas, MSErdei, JGunawan, ITurner, JHu, YWagner, EFan, KChopra, ROlland, ABard, JJacobsen, SMagolda, RLPangalos, MRobichaud, AJ Design and synthesis of 5,5'-disubstituted aminohydantoins as potent and selective human beta-secretase (BACE1) inhibitors. J Med Chem53:1146-58 (2010) 
 
Beta-secretase 2
Name:Beta-secretase 2
Type:Protein
Mol. Mass.:56171.20
Organism:Homo sapiens (Human)
Description:Q9Y5Z0
Residue:518
BDBM50303751
NameBDBM50303751
Synonyms:2-amino-4-(2,3-dihydrobenzo[b][1,4]dioxin-6-yl)-1-methyl-4-(3-(pyridin-3-yl)phenyl)-1H-imidazol-5(4H)-one | CHEMBL584917
TypeSmall organic molecule
Emp. Form.C23H20N4O3
Mol. Mass.400.4299
SMILESCN1C(N)=NC(C1=O)(c1cccc(c1)-c1cccnc1)c1ccc2OCCOc2c1