Reaction Details
TargetBeta-secretase 2
LigandBDBM50303745
Substrate/Competitorn/a
Meas. Tech.ChEMBL_597055 (CHEMBL1044550)
IC50 520±n/a nM
Citation Malamas, MSErdei, JGunawan, ITurner, JHu, YWagner, EFan, KChopra, ROlland, ABard, JJacobsen, SMagolda, RLPangalos, MRobichaud, AJ Design and synthesis of 5,5'-disubstituted aminohydantoins as potent and selective human beta-secretase (BACE1) inhibitors. J Med Chem53:1146-58 (2010) 
 
Beta-secretase 2
Name:Beta-secretase 2
Type:Protein
Mol. Mass.:56171.20
Organism:Homo sapiens (Human)
Description:Q9Y5Z0
Residue:518
BDBM50303745
NameBDBM50303745
Synonyms:2-amino-4-(3-fluoro-4-methoxyphenyl)-1-methyl-4-(3-(pyridin-3-yl)phenyl)-1H-imidazol-5(4H)-one | CHEMBL566223
TypeSmall organic molecule
Emp. Form.C22H19FN4O2
Mol. Mass.390.4103
SMILESCOc1ccc(cc1F)C1(N=C(N)N(C)C1=O)c1cccc(c1)-c1cccnc1