Reaction Details
TargetBeta-secretase 2
LigandBDBM50300229
Substrate/Competitorn/a
Meas. Tech.ChEMBL_597055 (CHEMBL1044550)
IC50 770±n/a nM
Citation Malamas, MSErdei, JGunawan, ITurner, JHu, YWagner, EFan, KChopra, ROlland, ABard, JJacobsen, SMagolda, RLPangalos, MRobichaud, AJ Design and synthesis of 5,5'-disubstituted aminohydantoins as potent and selective human beta-secretase (BACE1) inhibitors. J Med Chem53:1146-58 (2010) 
 
Beta-secretase 2
Name:Beta-secretase 2
Type:Protein
Mol. Mass.:56171.20
Organism:Homo sapiens (Human)
Description:Q9Y5Z0
Residue:518
BDBM50300229
NameBDBM50300229
Synonyms:1-methyl-4,4-diphenyl-4,5-dihydro-1H-imidazol-2-amine 2-amino-1-methyl-4,4-diphenyl-1H-imidazol-5(4H)-one CHEMBL291784
TypeSmall organic molecule
Emp. Form.C16H15N3O
Mol. Mass.265.3098
SMILESCN1C(N)=NC(C1=O)(c1ccccc1)c1ccccc1