Reaction Details
TargetBeta-secretase 2
LigandBDBM50303736
Substrate/Competitorn/a
Meas. Tech.ChEMBL_597055 (CHEMBL1044550)
IC50 550±n/a nM
Citation Malamas, MSErdei, JGunawan, ITurner, JHu, YWagner, EFan, KChopra, ROlland, ABard, JJacobsen, SMagolda, RLPangalos, MRobichaud, AJ Design and synthesis of 5,5'-disubstituted aminohydantoins as potent and selective human beta-secretase (BACE1) inhibitors. J Med Chem53:1146-58 (2010) 
 
Beta-secretase 2
Name:Beta-secretase 2
Type:Protein
Mol. Mass.:56171.20
Organism:Homo sapiens (Human)
Description:Q9Y5Z0
Residue:518
BDBM50303736
NameBDBM50303736
Synonyms:5-(2-amino-1-methyl-5-oxo-4-(3-(pyridin-3-yl)phenyl)-4,5-dihydro-1H-imidazol-4-yl)-2-methoxybenzonitrile | CHEMBL568114
TypeSmall organic molecule
Emp. Form.C23H19N5O2
Mol. Mass.397.4293
SMILESCOc1ccc(cc1C#N)C1(N=C(N)N(C)C1=O)c1cccc(c1)-c1cccnc1