Reaction Details
Target5-hydroxytryptamine receptor 1B
LigandBDBM50304075
Substrate/Competitorn/a
Meas. Tech.ChEMBL_601690 (CHEMBL1050425)
IC50>10000±n/a nM
Citation Peng, YZhang, QArora, SKeenan, SMKortagere, SWannemacher, KMHowells, RDWelsh, WJ Novel delta opioid receptor agonists exhibit differential stimulation of signaling pathways. Bioorg Med Chem17:6442-50 (2009) 
 
5-hydroxytryptamine receptor 1B
Name:5-hydroxytryptamine receptor 1B
Type:G Protein-Coupled Receptor (GPCR)
Mol. Mass.:43579.17
Organism:Homo sapiens (Human)
Description:Receptor binding assays were performed using human clone stably expressed in CHO cells
Residue:390
BDBM50304075
NameBDBM50304075
Synonyms:3-(5-(4-tert-butylphenyl)-3-((dimethylamino)methyl)-1H-1,2,4-triazol-1-yl)phenol | CHEMBL595449
TypeSmall organic molecule
Emp. Form.C21H26N4O
Mol. Mass.350.4573
SMILESCN(C)Cc1nc(-c2ccc(cc2)C(C)(C)C)n(n1)-c1cccc(O)c1