Reaction Details
TargetMu-type opioid receptor
LigandBDBM50304079
Substrate/Competitorn/a
Meas. Tech.ChEMBL_601678 (CHEMBL1049576)
IC50>10000±n/a nM
Citation Peng, YZhang, QArora, SKeenan, SMKortagere, SWannemacher, KMHowells, RDWelsh, WJ Novel delta opioid receptor agonists exhibit differential stimulation of signaling pathways. Bioorg Med Chem17:6442-50 (2009) 
 
Mu-type opioid receptor
Name:Mu-type opioid receptor
Type:Enzyme Catalytic Domain
Mol. Mass.:44431.62
Organism:MOUSE
Description:OPIATE Mu OPRM1 MOUSE::P42866
Residue:398
BDBM50304079
NameBDBM50304079
Synonyms:(5-(2,4-Dimethylphenyl)-1-(3-methoxyphenyl)-1H-1,2,4-triazol-3-yl)-N,N-dimethylmethanamine | CHEMBL611957
TypeSmall organic molecule
Emp. Form.C20H24N4O
Mol. Mass.336.4308
SMILESCOc1cccc(c1)-n1nc(CN(C)C)nc1-c1ccc(C)cc1C