Reaction Details
TargetDelta-type opioid receptor
LigandBDBM50304078
Substrate/Competitorn/a
Meas. Tech.ChEMBL_601677 (CHEMBL1049575)
IC50 1139±n/a nM
Citation Peng, YZhang, QArora, SKeenan, SMKortagere, SWannemacher, KMHowells, RDWelsh, WJ Novel delta opioid receptor agonists exhibit differential stimulation of signaling pathways. Bioorg Med Chem17:6442-50 (2009) 
 
Delta-type opioid receptor
Name:Delta-type opioid receptor
Type:Enzyme Catalytic Domain
Mol. Mass.:40577.25
Organism:MOUSE
Description:P32300
Residue:372
BDBM50304078
NameBDBM50304078
Synonyms:(1-(3-tert-Butylphenyl)-5-(3-methoxyphenyl)-1H-1,2,4-triazol-3-yl)-N,N-dimethylmethanamine | CHEMBL593844
TypeSmall organic molecule
Emp. Form.C22H28N4O
Mol. Mass.364.4839
SMILESCOc1cccc(c1)-c1nc(CN(C)C)nn1-c1cccc(c1)C(C)(C)C