Reaction Details
Target5-hydroxytryptamine receptor 5A
LigandBDBM50304075
Substrate/Competitorn/a
Meas. Tech.ChEMBL_601697 (CHEMBL1050432)
IC50>10000±n/a nM
Citation Peng, YZhang, QArora, SKeenan, SMKortagere, SWannemacher, KMHowells, RDWelsh, WJ Novel delta opioid receptor agonists exhibit differential stimulation of signaling pathways. Bioorg Med Chem17:6442-50 (2009) 
 
5-hydroxytryptamine receptor 5A
Name:5-hydroxytryptamine receptor 5A
Type:Enzyme
Mol. Mass.:40266.25
Organism:Homo sapiens (Human)
Description:P47898
Residue:357
BDBM50304075
NameBDBM50304075
Synonyms:3-(5-(4-tert-butylphenyl)-3-((dimethylamino)methyl)-1H-1,2,4-triazol-1-yl)phenol | CHEMBL595449
TypeSmall organic molecule
Emp. Form.C21H26N4O
Mol. Mass.350.4573
SMILESCN(C)Cc1nc(-c2ccc(cc2)C(C)(C)C)n(n1)-c1cccc(O)c1