Reaction Details
TargetHistamine H4 receptor
LigandBDBM50304503
Substrate/Competitorn/a
Meas. Tech.ChEMBL_603902 (CHEMBL1048581)
Ki 146±n/a nM
Citation Sander, KKottke, TTanrikulu, YProschak, EWeizel, LSchneider, EHSeifert, RSchneider, GStark, H 2,4-Diaminopyrimidines as histamine H4 receptor ligands--Scaffold optimization and pharmacological characterization. Bioorg Med Chem17:7186-96 (2009) 
 
Histamine H4 receptor
Name:Histamine H4 receptor
Type:G Protein-Coupled Receptor (GPCR)
Mol. Mass.:44517.02
Organism:Homo sapiens (Human)
Description:Binding assays were using CHO cells stably expressing hH4R receptors.
Residue:390
BDBM50304503
NameBDBM50304503
Synonyms:4-(3,4-Dihydroisoquinolin-2(1H)-yl)-6-(4-methylpiperazin-1-yl)pyrimidin-2-amine | CHEMBL594490
TypeSmall organic molecule
Emp. Form.C18H24N6
Mol. Mass.324.4234
SMILESCN1CCN(CC1)c1cc(nc(N)n1)N1CCc2ccccc2C1