Reaction Details
TargetHistamine H4 receptor
LigandBDBM50304514
Substrate/Competitorn/a
Meas. Tech.ChEMBL_603902 (CHEMBL1048581)
Ki 15600±n/a nM
Citation Sander, KKottke, TTanrikulu, YProschak, EWeizel, LSchneider, EHSeifert, RSchneider, GStark, H 2,4-Diaminopyrimidines as histamine H4 receptor ligands--Scaffold optimization and pharmacological characterization. Bioorg Med Chem17:7186-96 (2009) 
 
Histamine H4 receptor
Name:Histamine H4 receptor
Type:G Protein-Coupled Receptor (GPCR)
Mol. Mass.:44517.02
Organism:Homo sapiens (Human)
Description:Binding assays were using CHO cells stably expressing hH4R receptors.
Residue:390
BDBM50304514
NameBDBM50304514
Synonyms:6-(4-Methylpiperazin-1-yl)-9H-purin-2-amine | CHEMBL594694
TypeSmall organic molecule
Emp. Form.C10H15N7
Mol. Mass.233.273
SMILESCN1CCN(CC1)c1nc(N)nc2nc[nH]c12