Reaction Details
TargetHistamine H4 receptor
LigandBDBM50304530
Substrate/Competitorn/a
Meas. Tech.ChEMBL_603902 (CHEMBL1048581)
Ki 205±n/a nM
Citation Sander, KKottke, TTanrikulu, YProschak, EWeizel, LSchneider, EHSeifert, RSchneider, GStark, H 2,4-Diaminopyrimidines as histamine H4 receptor ligands--Scaffold optimization and pharmacological characterization. Bioorg Med Chem17:7186-96 (2009) 
 
Histamine H4 receptor
Name:Histamine H4 receptor
Type:G Protein-Coupled Receptor (GPCR)
Mol. Mass.:44517.02
Organism:Homo sapiens (Human)
Description:Binding assays were using CHO cells stably expressing hH4R receptors.
Residue:390
BDBM50304530
NameBDBM50304530
Synonyms:CHEMBL609161 | N4-(4-Methylbenzyl)-6-(4-methylpiperazin-1-yl)pyrimidine-2,4-diamine
TypeSmall organic molecule
Emp. Form.C17H24N6
Mol. Mass.312.4127
SMILESCN1CCN(CC1)c1cc(NCc2ccc(C)cc2)nc(N)n1