Reaction Details
TargetHistamine H2 receptor
LigandBDBM50304525
Substrate/Competitorn/a
Meas. Tech.ChEMBL_604063 (CHEMBL1046852)
Ki>1000±n/a nM
Citation Sander, KKottke, TTanrikulu, YProschak, EWeizel, LSchneider, EHSeifert, RSchneider, GStark, H 2,4-Diaminopyrimidines as histamine H4 receptor ligands--Scaffold optimization and pharmacological characterization. Bioorg Med Chem17:7186-96 (2009) 
 
Histamine H2 receptor
Name:Histamine H2 receptor
Type:G Protein-Coupled Receptor (GPCR)
Mol. Mass.:40115.31
Organism:Homo sapiens (Human)
Description:n/a
Residue:359
BDBM50304525
NameBDBM50304525
Synonyms:CHEMBL594731 | N4-(2-Methylbenzyl)-6-(4-methylpiperazin-1-yl)pyrimidine-2,4-diamine
TypeSmall organic molecule
Emp. Form.C17H24N6
Mol. Mass.312.4127
SMILESCN1CCN(CC1)c1cc(NCc2ccccc2C)nc(N)n1