Reaction Details
TargetTissue alpha-L-fucosidase
LigandBDBM50065258
Substrate/Competitorn/a
Meas. Tech.ChEMBL_604167 (CHEMBL1039761)
Ki 3±n/a nM
Citation Pearson, MSFloquet, NBello, CVogel, PPlantier-Royon, RSzymoniak, JBertus, PBehr, JB The spirocyclopropyl moiety as a methyl surrogate in the structure of l-fucosidase and l-rhamnosidase inhibitors. Bioorg Med Chem17:8020-6 (2009) 
 
Tissue alpha-L-fucosidase
Name:Tissue alpha-L-fucosidase
Type:PROTEIN
Mol. Mass.:54093.12
Organism:Bos taurus
Description:ChEMBL_335897
Residue:468
BDBM50065258
NameBDBM50065258
Synonyms:(2S,3R,4S,5R)-2-Methyl-piperidine-3,4,5-triol CHEMBL314772 | Fucosidase Inhibitor, 3
TypeSmall organic molecule
Emp. Form.C6H13NO3
Mol. Mass.147.1723
SMILESC[C@@H]1NC[C@@H](O)[C@H](O)[C@@H]1O