Reaction Details
TargetThyroid hormone receptor alpha
LigandBDBM50304777
Substrate/Competitorn/a
Meas. Tech.ChEMBL_605572 (CHEMBL1068515)
Ki 0.7±n/a nM
Citation Li, JJMitchell, LHDow, RL Thyroid receptor agonists for the treatment of androgenetic alopecia. Bioorg Med Chem Lett20:306-8 (2010) 
 
Thyroid hormone receptor alpha
Name:Thyroid hormone receptor alpha
Type:Receptor
Mol. Mass.:54818.00
Organism:Homo sapiens (Human)
Description:Recombinant hThR was obtained from nuclear extracts from SF9 cells infected with baculovirus vectors encoding for ThRalpha 1.
Residue:490
BDBM50304777
NameBDBM50304777
Synonyms:2-(4-(7-hydroxy-2,3-dihydro-1H-inden-4-yloxy)-3,5-dimethylphenylamino)-2-oxoacetic acid | CHEMBL608990
TypeSmall organic molecule
Emp. Form.C19H19NO5
Mol. Mass.341.3579
SMILESCc1cc(NC(=O)C(O)=O)cc(C)c1Oc1ccc(O)c2CCCc12