Reaction Details
TargetProgesterone receptor
LigandBDBM50304959
Substrate/Competitorn/a
Meas. Tech.ChEMBL_606887 (CHEMBL1071273)
IC50 25±n/a nM
Citation Kallander, LSWashburn, DGHoang, THFrazee, JSStoy, PJohnson, LLu, QHammond, MBarton, LSPatterson, JRAzzarano, LMNagilla, RMadauss, KPWilliams, SPStewart, ELDuraiswami, CGrygielko, ETXu, XLaping, NJBray, JDThompson, SK Improving the developability profile of pyrrolidine progesterone receptor partial agonists. Bioorg Med Chem Lett20:371-4 (2010) 
 
Progesterone receptor
Name:Progesterone receptor
Type:Protein
Mol. Mass.:98979.52
Organism:Homo sapiens (Human)
Description:P06401
Residue:933
BDBM50304959
NameBDBM50304959
Synonyms:(S)-2-chloro-4-((2,5-dichlorobenzyl)(1-propionylpyrrolidin-3-yl)amino)benzonitrile | CHEMBL589625
TypeSmall organic molecule
Emp. Form.C21H20Cl3N3O
Mol. Mass.436.762
SMILESCCC(=O)N1CC[C@@H](C1)N(Cc1cc(Cl)ccc1Cl)c1ccc(C#N)c(Cl)c1