Reaction Details
TargetProgesterone receptor
LigandBDBM50304981
Substrate/Competitorn/a
Meas. Tech.ChEMBL_606887 (CHEMBL1071273)
IC50 30±n/a nM
Citation Kallander, LSWashburn, DGHoang, THFrazee, JSStoy, PJohnson, LLu, QHammond, MBarton, LSPatterson, JRAzzarano, LMNagilla, RMadauss, KPWilliams, SPStewart, ELDuraiswami, CGrygielko, ETXu, XLaping, NJBray, JDThompson, SK Improving the developability profile of pyrrolidine progesterone receptor partial agonists. Bioorg Med Chem Lett20:371-4 (2010) 
 
Progesterone receptor
Name:Progesterone receptor
Type:Protein
Mol. Mass.:98979.52
Organism:Homo sapiens (Human)
Description:P06401
Residue:933
BDBM50304981
NameBDBM50304981
Synonyms:(S)-ethyl 3-((3-chloro-4-cyanophenyl)(5-fluoro-2-methylbenzyl)amino)pyrrolidine-1-carboxylate | CHEMBL601472
TypeSmall organic molecule
Emp. Form.C22H23ClFN3O2
Mol. Mass.415.888
SMILESCCOC(=O)N1CC[C@@H](C1)N(Cc1cc(F)ccc1C)c1ccc(C#N)c(Cl)c1