Reaction Details
TargetProgesterone receptor
LigandBDBM50304974
Substrate/Competitorn/a
Meas. Tech.ChEMBL_606887 (CHEMBL1071273)
IC50 16±n/a nM
Citation Kallander, LSWashburn, DGHoang, THFrazee, JSStoy, PJohnson, LLu, QHammond, MBarton, LSPatterson, JRAzzarano, LMNagilla, RMadauss, KPWilliams, SPStewart, ELDuraiswami, CGrygielko, ETXu, XLaping, NJBray, JDThompson, SK Improving the developability profile of pyrrolidine progesterone receptor partial agonists. Bioorg Med Chem Lett20:371-4 (2010) 
 
Progesterone receptor
Name:Progesterone receptor
Type:Protein
Mol. Mass.:98979.52
Organism:Homo sapiens (Human)
Description:P06401
Residue:933
BDBM50304974
NameBDBM50304974
Synonyms:(S)-2-chloro-4-((2-methylbenzyl)(1-(methylsulfonyl)pyrrolidin-3-yl)amino)benzonitrile CHEMBL601500
TypeSmall organic molecule
Emp. Form.C20H22ClN3O2S
Mol. Mass.403.926
SMILESCc1ccccc1CN([C@H]1CCN(C1)S(C)(=O)=O)c1ccc(C#N)c(Cl)c1