Reaction Details
TargetProgesterone receptor
LigandBDBM50304971
Substrate/Competitorn/a
Meas. Tech.ChEMBL_606887 (CHEMBL1071273)
IC50 20±n/a nM
Citation Kallander, LSWashburn, DGHoang, THFrazee, JSStoy, PJohnson, LLu, QHammond, MBarton, LSPatterson, JRAzzarano, LMNagilla, RMadauss, KPWilliams, SPStewart, ELDuraiswami, CGrygielko, ETXu, XLaping, NJBray, JDThompson, SK Improving the developability profile of pyrrolidine progesterone receptor partial agonists. Bioorg Med Chem Lett20:371-4 (2010) 
 
Progesterone receptor
Name:Progesterone receptor
Type:Protein
Mol. Mass.:98979.52
Organism:Homo sapiens (Human)
Description:P06401
Residue:933
BDBM50304971
NameBDBM50304971
Synonyms:(S)-2-chloro-4-((2-fluorobenzyl)(1-(methylsulfonyl)pyrrolidin-3-yl)amino)benzonitrile | CHEMBL584422
TypeSmall organic molecule
Emp. Form.C19H19ClFN3O2S
Mol. Mass.407.889
SMILESCS(=O)(=O)N1CC[C@@H](C1)N(Cc1ccccc1F)c1ccc(C#N)c(Cl)c1