Reaction Details
TargetMAP kinase-activated protein kinase 2
LigandBDBM50304992
Substrate/Competitorn/a
Meas. Tech.ChEMBL_606910 (CHEMBL1072653)
IC50 14000±n/a nM
Citation Harris, CMEricsson, AMArgiriadi, MABarberis, CBorhani, DWBurchat, ACalderwood, DJCunha, GADixon, RWFrank, KEJohnson, EFKamens, JKwak, SLi, BMullen, KDPerron, DCWang, LWishart, NWu, XZhang, XZmetra, TRTalanian, RV 2,4-Diaminopyrimidine MK2 inhibitors. Part II: Structure-based inhibitor optimization. Bioorg Med Chem Lett20:334-7 (2010) 
 
MAP kinase-activated protein kinase 2
Name:MAP kinase-activated protein kinase 2
Type:Serine/threonine-protein kinase
Mol. Mass.:45579.87
Organism:Homo sapiens (Human)
Description:P49137
Residue:400
BDBM50304992
NameBDBM50304992
Synonyms:CHEMBL584617 | N4-(3-iodo-1H-indazol-5-yl)pyrimidine-2,4-diamine
TypeSmall organic molecule
Emp. Form.C11H9IN6
Mol. Mass.352.1338
SMILESNc1nccc(Nc2ccc3[nH]nc(I)c3c2)n1