Reaction Details
TargetMAP kinase-activated protein kinase 2
LigandBDBM50304994
Substrate/Competitorn/a
Meas. Tech.ChEMBL_606910 (CHEMBL1072653)
IC50 720±n/a nM
Citation Harris, CMEricsson, AMArgiriadi, MABarberis, CBorhani, DWBurchat, ACalderwood, DJCunha, GADixon, RWFrank, KEJohnson, EFKamens, JKwak, SLi, BMullen, KDPerron, DCWang, LWishart, NWu, XZhang, XZmetra, TRTalanian, RV 2,4-Diaminopyrimidine MK2 inhibitors. Part II: Structure-based inhibitor optimization. Bioorg Med Chem Lett20:334-7 (2010) 
 
MAP kinase-activated protein kinase 2
Name:MAP kinase-activated protein kinase 2
Type:Serine/threonine-protein kinase
Mol. Mass.:45579.87
Organism:Homo sapiens (Human)
Description:P49137
Residue:400
BDBM50304994
NameBDBM50304994
Synonyms:CHEMBL589650 | N4-(7-(naphthalen-2-yl)-1H-indazol-5-yl)pyrimidine-2,4-diamine
TypeSmall organic molecule
Emp. Form.C21H16N6
Mol. Mass.352.3919
SMILESNc1nccc(Nc2cc(-c3ccc4ccccc4c3)c3[nH]ncc3c2)n1