Reaction Details
TargetMAP kinase-activated protein kinase 2
LigandBDBM50305002
Substrate/Competitorn/a
Meas. Tech.ChEMBL_606910 (CHEMBL1072653)
IC50 1400±n/a nM
Citation Harris, CMEricsson, AMArgiriadi, MABarberis, CBorhani, DWBurchat, ACalderwood, DJCunha, GADixon, RWFrank, KEJohnson, EFKamens, JKwak, SLi, BMullen, KDPerron, DCWang, LWishart, NWu, XZhang, XZmetra, TRTalanian, RV 2,4-Diaminopyrimidine MK2 inhibitors. Part II: Structure-based inhibitor optimization. Bioorg Med Chem Lett20:334-7 (2010) 
 
MAP kinase-activated protein kinase 2
Name:MAP kinase-activated protein kinase 2
Type:Serine/threonine-protein kinase
Mol. Mass.:45579.87
Organism:Homo sapiens (Human)
Description:P49137
Residue:400
BDBM50305002
NameBDBM50305002
Synonyms:7-(1H-indazol-5-yl)-5H-pyrrolo[3,2-d]pyrimidin-2-amine | CHEMBL591071
TypeSmall organic molecule
Emp. Form.C13H10N6
Mol. Mass.250.2587
SMILESNc1ncc2[nH]cc(-c3ccc4n[nH]cc4c3)c2n1