Reaction Details
TargetMAP kinase-activated protein kinase 2
LigandBDBM50305015
Substrate/Competitorn/a
Meas. Tech.ChEMBL_606910 (CHEMBL1072653)
IC50>50000±n/a nM
Citation Harris, CMEricsson, AMArgiriadi, MABarberis, CBorhani, DWBurchat, ACalderwood, DJCunha, GADixon, RWFrank, KEJohnson, EFKamens, JKwak, SLi, BMullen, KDPerron, DCWang, LWishart, NWu, XZhang, XZmetra, TRTalanian, RV 2,4-Diaminopyrimidine MK2 inhibitors. Part II: Structure-based inhibitor optimization. Bioorg Med Chem Lett20:334-7 (2010) 
 
MAP kinase-activated protein kinase 2
Name:MAP kinase-activated protein kinase 2
Type:Serine/threonine-protein kinase
Mol. Mass.:45579.87
Organism:Homo sapiens (Human)
Description:P49137
Residue:400
BDBM50305015
NameBDBM50305015
Synonyms:7-(7-(benzo[b]thiophen-2-yl)-1H-indazol-5-yl)-5-(cyclopenta-2,4-dienyl)-5H-pyrrolo[3,2-d]pyrimidin-2-amine | CHEMBL605922
TypeSmall organic molecule
Emp. Form.C26H18N6S
Mol. Mass.446.526
SMILESNc1ncc2n(cc(-c3cc(-c4cc5ccccc5s4)c4[nH]ncc4c3)c2n1)C1C=CC=C1