Reaction Details
TargetBDNF/NT-3 growth factors receptor
LigandBDBM50305006
Substrate/Competitorn/a
Meas. Tech.ChEMBL_606987 (CHEMBL1073314)
IC50>10000±n/a nM
Citation Harris, CMEricsson, AMArgiriadi, MABarberis, CBorhani, DWBurchat, ACalderwood, DJCunha, GADixon, RWFrank, KEJohnson, EFKamens, JKwak, SLi, BMullen, KDPerron, DCWang, LWishart, NWu, XZhang, XZmetra, TRTalanian, RV 2,4-Diaminopyrimidine MK2 inhibitors. Part II: Structure-based inhibitor optimization. Bioorg Med Chem Lett20:334-7 (2010) 
 
BDNF/NT-3 growth factors receptor
Name:BDNF/NT-3 growth factors receptor
Type:Enzyme
Mol. Mass.:91996.87
Organism:Homo sapiens (Human)
Description:Q16620
Residue:822
BDBM50305006
NameBDBM50305006
Synonyms:5-(2-aminoethyl)-7-(7-(benzo[b]thiophen-2-yl)-1H-indazol-5-yl)-5H-pyrrolo[3,2-d]pyrimidin-2-amine | CHEMBL590109
TypeSmall organic molecule
Emp. Form.C23H19N7S
Mol. Mass.425.509
SMILESNCCn1cc(-c2cc(-c3cc4ccccc4s3)c3[nH]ncc3c2)c2nc(N)ncc12