Reaction Details
TargetAcyl-CoA desaturase 1
LigandBDBM50305767
Substrate/Competitorn/a
Meas. Tech.ChEMBL_604760 (CHEMBL1072554)
IC50 2.9±n/a nM
Citation Léger, SBlack, WCDeschenes, DDolman, SFalgueyret, JPGagnon, MGuiral, SHuang, ZGuay, JLeblanc, YLi, CSMassé, FOballa, RZhang, L Synthesis and biological activity of a potent and orally bioavailable SCD inhibitor (MF-438). Bioorg Med Chem Lett20:499-502 (2010) 
 
Acyl-CoA desaturase 1
Name:Acyl-CoA desaturase 1
Type:Enzyme
Mol. Mass.:41485.97
Organism:Rattus norvegicus (Rat)
Description:P07308
Residue:358
BDBM50305767
NameBDBM50305767
Synonyms:(5-(6-(4-(2-(trifluoromethyl)phenoxy)piperidin-1-yl)pyridazin-3-yl)-1,3,4-oxadiazol-2-yl)methanol | CHEMBL594901
TypeSmall organic molecule
Emp. Form.C19H18F3N5O3
Mol. Mass.421.3731
SMILESOCc1nnc(o1)-c1ccc(nn1)N1CCC(CC1)Oc1ccccc1C(F)(F)F