Reaction Details
TargetRAC-beta serine/threonine-protein kinase
LigandBDBM50305881
Substrate/Competitorn/a
Meas. Tech.ChEMBL_605290 (CHEMBL1069942)
IC50 39±n/a nM
Citation Lin, HYamashita, DSZeng, JXie, RVerma, SLuengo, JIRhodes, NZhang, SRobell, KAChoudhry, AELai, ZKumar, RMinthorn, EABrown, KKHeerding, DA 2,3,5-Trisubstituted pyridines as selective AKT inhibitors. Part II: Improved drug-like properties and kinase selectivity from azaindazoles. Bioorg Med Chem Lett20:679-83 (2010) 
 
RAC-beta serine/threonine-protein kinase
Name:RAC-beta serine/threonine-protein kinase
Type:Enzyme
Mol. Mass.:55766.64
Organism:Homo sapiens (Human)
Description:n/a
Residue:481
BDBM50305881
NameBDBM50305881
Synonyms:(S)-1-(6-(furan-3-yl)-5-(3-methyl-1H-pyrazolo[4,3-b]pyrazin-5-yl)pyridin-3-yloxy)-3-(1H-indol-3-yl)propan-2-amine | CHEMBL596290
TypeSmall organic molecule
Emp. Form.C26H23N7O2
Mol. Mass.465.5065
SMILESCc1n[nH]c2ncc(nc12)-c1cc(OC[C@@H](N)Cc2c[nH]c3ccccc23)cnc1-c1ccoc1