Reaction Details
TargetGlycogen synthase kinase-3 beta
LigandBDBM50305878
Substrate/Competitorn/a
Meas. Tech.ChEMBL_605292 (CHEMBL1071317)
IC50 500±n/a nM
Citation Lin, HYamashita, DSZeng, JXie, RVerma, SLuengo, JIRhodes, NZhang, SRobell, KAChoudhry, AELai, ZKumar, RMinthorn, EABrown, KKHeerding, DA 2,3,5-Trisubstituted pyridines as selective AKT inhibitors. Part II: Improved drug-like properties and kinase selectivity from azaindazoles. Bioorg Med Chem Lett20:679-83 (2010) 
 
Glycogen synthase kinase-3 beta
Name:Glycogen synthase kinase-3 beta
Type:Enzyme
Mol. Mass.:46756.38
Organism:Homo sapiens (Human)
Description:P49841
Residue:420
BDBM50305878
NameBDBM50305878
Synonyms:(2S)-1-{[6-furan-3-yl-5-(3-methyl-2H-indazol-5-yl)pyridin-3-yl]oxy}-3-(1H-indol-3-yl)propan-2-amine CHEMBL593490
TypeSmall organic molecule
Emp. Form.C28H25N5O2
Mol. Mass.463.5304
SMILESCc1n[nH]c2ccc(cc12)-c1cc(OC[C@@H](N)Cc2c[nH]c3ccccc23)cnc1-c1ccoc1