Reaction Details
TargetDelta-type opioid receptor
LigandBDBM50306298
Substrate/Competitorn/a
Meas. Tech.ChEMBL_607037 (CHEMBL1074665)
Ki 0.900000±n/a nM
Citation Liras, SMcHardy, SFAllen, MPSegelstein, BEHeck, SDBryce, DKSchmidt, AWVanase-Frawley, MCallegari, EMcLean, S Biaryl piperidines as potent and selective delta opioid receptor ligands. Bioorg Med Chem Lett20:503-7 (2010) 
 
Delta-type opioid receptor
Name:Delta-type opioid receptor
Type:G Protein-Coupled Receptor (GPCR)
Mol. Mass.:40382.98
Organism:Homo sapiens (Human)
Description:Competition binding assays were carried out using membrane preparations from transfected HN9.10 cells that constitutively expressed the delta opioid receptor.
Residue:372
BDBM50306298
NameBDBM50306298
Synonyms:CHEMBL595472 | N,N-diethyl-4-(4-(3-hydroxyphenyl)-1-phenethylpiperidin-4-yl)benzamide
TypeSmall organic molecule
Emp. Form.C30H36N2O2
Mol. Mass.456.619
SMILESCCN(CC)C(=O)c1ccc(cc1)C1(CCN(CCc2ccccc2)CC1)c1cccc(O)c1